{"text_format":"1","workbook":"xlsx","n_sheets":4,"sheets":["Explication","Feuille perso","Carrière-Compétence","Équipement-Titre"],"not_rendered":{"charts":0,"images":0,"macros":1,"external_links":0,"defined_names":19,"comments":0,"pivot_tables":0},"unopened":[],"bounds":{"document_bytes":16777216,"sheet_cells":100000,"rows_first":2000,"rows_last":500,"rows_between":2000,"halvings":0,"cell_chars":16384,"cell_head_chars":4096},"cells_cut":0,"cells_raw":0,"read":"whole","date_system":"1900"}

{"sheet":"Explication","index":0,"n_rows":24,"n_cols":2,"rows_kept":24,"cut":false,"hidden":false,"merged":[]}
[null,"Tout ce qui est en blanc ne peut pas être modifié"]
[]
[null,"Feuille Perso"]
[null,"= Ce que vous avez sur votre feuille"]
[null,"= Qualité de votre équipement"]
[null,"= Inscrivez \"oui\" pour dire que c'est celui que vous avez équipé"]
[null,"= Tout bonus qui modifie le chiffre de base"]
[null,"= Tout bonus qui modifie le chiffre de base en %. Exemple si bonus de 5% inscrire 105%"]
[null,"= Juste le chiffre sans le %. Exemple si +25% critique juste inscrire 25"]
[null,"= Inscriver le bonus de protection innée ou de qualité d'équipement et en bas de la colonne faite le total"]
[]
[null,"Carrière-Compétence"]
[null,"= Inscrire le nombre de point mis dans cette carrière"]
[null,"= Inscrire le terme donné par le Maître de jeu"]
[null,"= Compétence affecté par l'encombrement d'armure"]
[null,"= Point de compétence dépensé par vous"]
[null,"= Point de compétence bonus donné par une carrière"]
[null,"= Point de compétence bonus donné par une carrière pour toute la catégorie"]
[null,"=Compétence aquise suite à un événement"]
[null,"La colonne total vous donne le résultat de tout le calcul incluant votre armure"]
{"$rows_left_out":5}
{"sheet":"Feuille perso","index":1,"n_rows":52,"n_cols":24,"rows_kept":52,"cut":false,"hidden":false,"merged":[[1,13,1,14],[2,13,2,14],[3,13,3,14],[4,13,4,14],[5,13,5,14],[51,0,51,2],[43,0,43,1],[44,0,44,1],[45,0,45,1],[46,0,46,1],[47,0,47,1],[48,0,48,1],[49,0,49,1],[50,0,50,1],[25,2,25,3],[23,2,23,3],[24,2,24,3],[0,4,0,5],[1,4,1,5],[2,4,2,5],[10,2,10,3],[20,2,20,3],[4,2,4,5],[5,2,5,5],[6,2,6,5],[7,2,7,5],[8,2,8,5],[18,0,18,1],[40,0,40,1],[41,0,41,1],[42,0,42,1],[34,0,34,1],[35,0,35,1],[36,0,36,1],[37,0,37,1],[38,0,38,1],[39,0,39,1],[26,0,26,3],[32,2,32,3],[31,2,31,3],[28,2,28,3],[29,2,29,3],[30,2,30,3],[8,0,8,1],[14,0,14,1],[15,0,15,1],[16,0,16,1],[17,0,17,1],[0,0,0,1],[1,0,1,1],[2,0,2,1],[4,0,4,1],[5,0,5,1],[6,0,6,1],[17,2,17,3],[18,2,18,3],[21,2,21,3],[22,2,22,3],[11,2,11,3],[12,2,12,3],[13,2,13,3],[14,2,14,3],[15,2,15,3],[16,2,16,3],[10,0,10,1],[11,0,11,1],[12,0,12,1],[13,0,13,1],[7,0,7,1],[37,16,37,18],[36,5,36,6],[35,10,35,11],[36,10,36,11],[35,7,35,9],[36,7,36,9],[35,5,35,6],[39,6,39,9],[40,6,40,9],[41,6,41,9],[42,6,42,9],[43,6,43,9]]}
["Expérience",null,null,null,"Physique",null,{"$f":"IF($C$7<>0,VLOOKUP($C$7,Carrière_complète,15,FALSE),0)","v":0},null,null,null,null,null,null,"Bonus %",null,"Bonus +"]
["Âge",null,null,null,"Mental",null,{"$f":"IF($C$7<>0,VLOOKUP($C$7,Carrière_complète,16,FALSE),0)","v":0},null,null,"Points de vie",null,null,{"$f":"ROUND((((G1+10)*C1)/10)*N2+P2+10,0)","v":10},1]
["Essence",null,null,null,"Réaction",null,{"$f":"IF($C$7<>0,VLOOKUP($C$7,Carrière_complète,17,FALSE),0)","v":0},null,null,"Points de magie",null,null,{"$f":"IF(G2=0,0,ROUND(G2*VLOOKUP(\"Oui\",A22:N26,14,FALSE)*N3+P3+IF(G2>=6,R3,0),0))","v":0},1,null,null,"M>=6"]
[null,null,null,null,null,null,null,null,null,"Force magique Arcane",null,null,{"$f":"ROUND(($C$1*$G$2/40)*(N4+VLOOKUP(\"oui\",$F$41:$M$44,6,FALSE))+1+P4,0)","v":1},1]
["Maison",null,null,null,null,null,"Rang",null,null,"Force magique Divine",null,null,{"$f":"ROUND(($C$1*$G$2/40)*(N5+VLOOKUP(\"oui\",$F$41:$M$44,7,FALSE))+1+P5,0)","v":1},1]
["Titre",null,null,null,null,null,"Salaire",{"$f":"IF($C$6=0,0,VLOOKUP($C$6,Titre_Complet,2,FALSE))","v":0},null,"Force magique Maudit",null,null,{"$f":"ROUND(($C$1*$G$2/40)*(N6+VLOOKUP(\"oui\",$F$41:$M$44,8,FALSE))+1+P6,0)","v":1},1]
["Carrière",null,null,null,null,null,"Or",null,null,"Champ d'action",null,null,{"$f":"IF(AND(A30=0,A31=0,A32=0,A33=0),6,6+N7+VLOOKUP(\"Oui\",A30:I33,6,FALSE))","v":6}]
["Dogme",null,null,null,null,null,null,null,null,"Vitesse de tour",null,null,{"$f":"15-G3","v":15}]
["Naissance",null,null,null,null,null,null,null,null,"Mouvement",null,null,{"$f":"IF(AND(A22=0,A23=0,A24=0,A25=0,A26=0),6+N9,6-VLOOKUP(\"Oui\",A22:N26,10,FALSE)+N9+VLOOKUP(\"Oui\",A22:N26,11,FALSE))","v":6}]
[]
["Arme",null,"Qualité",null,"Type","Port.","Bonus","Att.","Bonus","Bonus %","Dégâts","Dés","Crit.","Bon.","Mal.","Bon.","Face","Bon.","Flanc","Bon.","Dos","Bon."]
["Aucune",null,null,null,{"$f":"IF(A12=0,0,VLOOKUP(A12,Arme_Complète,9,FALSE))","v":"M / C"},{"$f":"IF(A12=0,0,IF(C12<>0,VLOOKUP(A12,Arme_Complète,2,FALSE)+VLOOKUP(C12,Qualité_Complète,4,FALSE)+G12,VLOOKUP(A12,Arme_Complète,2,FALSE)+G12))","v":1},null,{"$f":"IF(A12=0,0,IF($C12<>0,VLOOKUP($A12,Arme_Complète,3,FALSE)*VLOOKUP($C12,Qualité_Complète,3,FALSE),VLOOKUP($A12,Arme_Complète,3,FALSE)))","v":0},null,1,{"$f":"ROUND((($C$1*(H12+I12)*$G$1)/500)*J12+2,0)","v":2},{"$f":"VLOOKUP(K12,Dégat,3,TRUE)","v":"1d3"},{"$f":"IF(A12=0,0,IF(C12<>0,VLOOKUP(A12,Arme_Complète,4,FALSE)+VLOOKUP(C12,Qualité_Complète,5,FALSE)+N12,VLOOKUP(A12,Arme_Complète,4,FALSE)+N12))","v":150},null,{"$f":"IF(A12=0,0,VLOOKUP(A12,Arme_Complète,5,FALSE)-$G$2-P12)","v":9},null,{"$f":"IF(A12=0,0,IF(C12<>0,VLOOKUP(A12,Arme_Complète,6,FALSE)-VLOOKUP(C12,Qualité_Complète,6,FALSE)-R12,VLOOKUP(A12,Arme_Complète,6,FALSE)-R12))","v":8},null,{"$f":"IF(A12=0,0,IF(C12<>0,VLOOKUP(A12,Arme_Complète,7,FALSE)-VLOOKUP(C12,Qualité_Complète,7,FALSE)-T12,VLOOKUP(A12,Arme_Complète,7,FALSE)-T12))","v":7},null,{"$f":"IF(A12=0,0,IF(C12<>0,VLOOKUP(A12,Arme_Complète,8,FALSE)-VLOOKUP(C12,Qualité_Complète,8,FALSE)-V12,VLOOKUP(A12,Arme_Complète,8,FALSE)-V12))","v":6}]
[null,null,null,null,0,0,null,0,null,1,{"$f":"ROUND((($C$1*(H13+I13)*$G$1)/500)*J13+2,0)","v":2},"1d3",0,null,0,null,0,null,0,null,0]
[null,null,null,null,0,0,null,0,null,1,2,"1d3",0,null,0,null,0,null,0,null,0]
[null,null,null,null,0,0,null,0,null,1,2,"1d3",0,null,0,null,0,null,0,null,0]
[null,null,null,null,0,0,null,0,null,1,2,"1d3",0,null,0,null,0,null,0,null,0]
[null,null,null,null,0,0,null,0,null,1,2,"1d3",0,null,0,null,0,null,0,null,0]
[null,null,null,null,0,0,null,0,null,1,2,"1d3",0,null,0,null,0,null,0,null,0]
[null,null,null,null,0,0,null,0,null,1,2,"1d3",0,null,0,null,0,null,0,null,0]
[]
{"$rows_left_out":33}
{"sheet":"Carrière-Compétence","index":2,"n_rows":194,"n_cols":49,"rows_kept":194,"cut":false,"hidden":false,"merged":[]}
["Page","Nom","# de pex","Password",null,null,"Bonus Catégorie",null,null,null,null,"Bonus Catégorie",null,null,null,null,"Bonus Catégorie",null,null,null,null,"Bonus Catégorie",null,null,null,null,"Bonus Catégorie",null,null,null,null,null,"Nom","Manuelle","Habileté","Sens","Sociale","Connaissance","Choix",null,"Manuelle","Habileté","Sens","Sociale","Connaissance","Choix","P","M","R"]
[null,null,null,null,"Âge",{"$f":"'Feuille perso'!C2","v":0},"Manuelle","Point","Bonus","Malus","Total","Habileté","Point","Bonus","Malus","Total","Sens","Point","Bonus","Malus","Total","Sociale","Point","Bonus","Malus","Total","Connaissance","Point","Bonus","Malus","Total"]
[1,"Brute",null,null,null,null,"Alcool",null,null,null,{"$f":"H3+I3+J3+$I$1","v":0},"Acrobatie",null,null,{"$f":"IF(AND('Feuille perso'!$B$22=0,'Feuille perso'!$B$23=0,'Feuille perso'!$B$24=0,'Feuille perso'!$B$25=0,'Feuille perso'!$B$26=0),0,VLOOKUP(\"Oui\",'Feuille perso'!$A$22:$N$26,12,FALSE)+VLOOKUP(\"Oui\",'Feuille perso'!$A$22:$N$26,13,FALSE))","v":0},{"$f":"M3+N3+O3+$N$1","v":0},"Analyse",null,null,null,{"$f":"R3+S3+T3+$S$1","v":0},"Baratin",null,null,null,{"$f":"W3+X3+Y3+$X$1","v":0},"Ancien culte",null,null,null,{"$f":"AB3+AC3+AD3+$AC$1","v":0},null,"Brute",1,1,null,null,null,1,null,{"$f":"AH3*$C3","v":0},{"$f":"AI3*$C3","v":0},0,0,0,0,7,2,6]
[2,{"$f":"IF(AND(C3>5,D4=\"\"),AG4,0)","v":0},null,null,null,null,"Artisanat",null,null,null,{"$f":"H4+I4+J4+$I$1","v":0},"Camouflage nature",null,null,{"$f":"IF(AND('Feuille perso'!$B$22=0,'Feuille perso'!$B$23=0,'Feuille perso'!$B$24=0,'Feuille perso'!$B$25=0,'Feuille perso'!$B$26=0),0,VLOOKUP(\"Oui\",'Feuille perso'!$A$22:$N$26,12,FALSE)+VLOOKUP(\"Oui\",'Feuille perso'!$A$22:$N$26,13,FALSE))","v":0},{"$f":"M4+N4+O4+$N$1","v":0},"Concentration",null,null,{"$f":"IF(AND('Feuille perso'!$B$22=0,'Feuille perso'!$B$23=0,'Feuille perso'!$B$24=0,'Feuille perso'!$B$25=0,'Feuille perso'!$B$26=0),0,VLOOKUP(\"Oui\",'Feuille perso'!$A$22:$N$26,12,FALSE)+VLOOKUP(\"Oui\",'Feuille perso'!$A$22:$N$26,13,FALSE))","v":0},{"$f":"R4+S4+T4+$S$1","v":0},"Corruption",null,null,null,{"$f":"W4+X4+Y4+$X$1","v":0},"Astronomie",null,null,null,{"$f":"AB4+AC4+AD4+$AC$1","v":0},null,null,null,null,null,null,null,null,null,{"$f":"AH4*$C4","v":0},{"$f":"AI4*$C4","v":0},{"$f":"AJ4*$C4","v":0},{"$f":"AK4*$C4","v":0},{"$f":"AL4*$C4","v":0},{"$f":"AM4*$C4","v":0}]
[3,{"$f":"IF(AND(C4>5,D5=\"\",B4<>0),AG5,0)","v":0},null,null,"Manuel",{"$f":"AO156","v":0},"Chapenterie",null,null,null,0,"Camouflage urbain",null,null,{"$f":"IF(AND('Feuille perso'!$B$22=0,'Feuille perso'!$B$23=0,'Feuille perso'!$B$24=0,'Feuille perso'!$B$25=0,'Feuille perso'!$B$26=0),0,VLOOKUP(\"Oui\",'Feuille perso'!$A$22:$N$26,12,FALSE)+VLOOKUP(\"Oui\",'Feuille perso'!$A$22:$N$26,13,FALSE))","v":0},0,"Cuisine",null,null,null,0,"Éloquence",null,null,null,0,"Bibliothèques",null,null,null,0,null,null,null,null,null,null,null,null,null,0,0,0,0,0,0]
[4,"Milicien",null,null,"Habileté",{"$f":"AP156","v":0},"Chasse et pêche",null,null,{"$f":"IF(AND('Feuille perso'!$B$22=0,'Feuille perso'!$B$23=0,'Feuille perso'!$B$24=0,'Feuille perso'!$B$25=0,'Feuille perso'!$B$26=0),0,VLOOKUP(\"Oui\",'Feuille perso'!$A$22:$N$26,12,FALSE)+VLOOKUP(\"Oui\",'Feuille perso'!$A$22:$N$26,13,FALSE))","v":0},0,"Crochetage",null,null,null,0,"Détection",null,null,null,0,"Empathie",null,null,null,0,"Créatures",null,null,null,0,null,"Milicien",1,null,null,1,null,1,null,0,0,0,0,0,0,7,3,5]
[5,{"$f":"IF(AND(C6>5,D7=\"\"),AG7,0)","v":0},null,null,"Sens",{"$f":"AQ156","v":0},"Conduite",null,null,null,0,"Déguisements",null,null,null,0,"Dressage",null,null,null,0,"Faux papiers",null,null,null,0,"Géographie",null,null,null,0,null,null,null,null,null,null,null,null,null,0,0,0,0,0,0]
[6,{"$f":"IF(AND(C7>5,D8=\"\",B7<>0),AG8,0)","v":0},null,null,"Social",{"$f":"AR156","v":0},"Cordes",null,null,null,0,"Démolition",null,null,null,0,"Écoute",null,null,null,0,"Hypnotisme",null,null,null,0,"Histoire",null,null,null,0,null,null,null,null,null,null,null,null,null,0,0,0,0,0,0]
[7,"Volontaire",null,null,"Connaissance",{"$f":"AS156","v":0},"Course",null,null,{"$f":"IF(AND('Feuille perso'!$B$22=0,'Feuille perso'!$B$23=0,'Feuille perso'!$B$24=0,'Feuille perso'!$B$25=0,'Feuille perso'!$B$26=0),0,VLOOKUP(\"Oui\",'Feuille perso'!$A$22:$N$26,12,FALSE)+VLOOKUP(\"Oui\",'Feuille perso'!$A$22:$N$26,13,FALSE))","v":0},0,"Discrétion nature",null,null,{"$f":"IF(AND('Feuille perso'!$B$22=0,'Feuille perso'!$B$23=0,'Feuille perso'!$B$24=0,'Feuille perso'!$B$25=0,'Feuille perso'!$B$26=0),0,VLOOKUP(\"Oui\",'Feuille perso'!$A$22:$N$26,12,FALSE)+VLOOKUP(\"Oui\",'Feuille perso'!$A$22:$N$26,13,FALSE))","v":0},0,"Évaluation",null,null,null,0,"Intimidation",null,null,null,0,"Identification",null,null,null,0,null,"Volontaire",1,null,null,null,1,1,null,0,0,0,0,0,0,7,4,4]
[8,{"$f":"IF(AND(C9>5,D10=\"\"),AG13,0)","v":0},null,null,"Choix",{"$f":"IF(F2<50,F2,50)+AT156","v":0},"Équilibre",null,null,{"$f":"IF(AND('Feuille perso'!$B$22=0,'Feuille perso'!$B$23=0,'Feuille perso'!$B$24=0,'Feuille perso'!$B$25=0,'Feuille perso'!$B$26=0),0,VLOOKUP(\"Oui\",'Feuille perso'!$A$22:$N$26,12,FALSE)+VLOOKUP(\"Oui\",'Feuille perso'!$A$22:$N$26,13,FALSE))","v":0},0,"Discrétion urbaine",null,null,{"$f":"IF(AND('Feuille perso'!$B$22=0,'Feuille perso'!$B$23=0,'Feuille perso'!$B$24=0,'Feuille perso'!$B$25=0,'Feuille perso'!$B$26=0),0,VLOOKUP(\"Oui\",'Feuille perso'!$A$22:$N$26,12,FALSE)+VLOOKUP(\"Oui\",'Feuille perso'!$A$22:$N$26,13,FALSE))","v":0},0,"Lecture labiale",null,null,null,0,"Jargon secret",null,null,null,0,"Maisons",null,null,null,0,null,null,null,null,null,null,null,null,null,0,0,0,0,0,0]
[9,{"$f":"IF(AND(C10>5,D11=\"\",B10<>0),AG14,0)","v":0},null,null,null,null,"Équitation",null,null,null,0,"Dissimulation",null,null,null,0,"Météorologie",null,null,null,0,"Jeu",null,null,null,0,"Nature",null,null,null,0,null,null,null,null,null,null,null,null,null,0,0,0,0,0,0]
[10,"Écuyer",null,null,"Total reçu",{"$f":"SUM(F5:F10)+F21","v":0},"Escalade",null,null,{"$f":"IF(AND('Feuille perso'!$B$22=0,'Feuille perso'!$B$23=0,'Feuille perso'!$B$24=0,'Feuille perso'!$B$25=0,'Feuille perso'!$B$26=0),0,VLOOKUP(\"Oui\",'Feuille perso'!$A$22:$N$26,12,FALSE)+VLOOKUP(\"Oui\",'Feuille perso'!$A$22:$N$26,13,FALSE))","v":0},0,"Médecine",null,null,null,0,"Observation",null,null,null,0,"Leadership",null,null,null,0,"Occultisme",null,null,null,0,null,"Écuyer",1,1,null,1,null,1,null,0,0,0,0,0,0,7,5,3]
[11,{"$f":"IF(AND(C12>5,D13=\"\"),AG16,0)","v":0},null,null,"Total dépensé",{"$f":"SUM(H21:AB21)","v":0},"Lutte",null,null,{"$f":"IF(AND('Feuille perso'!$B$22=0,'Feuille perso'!$B$23=0,'Feuille perso'!$B$24=0,'Feuille perso'!$B$25=0,'Feuille perso'!$B$26=0),0,VLOOKUP(\"Oui\",'Feuille perso'!$A$22:$N$26,12,FALSE)+VLOOKUP(\"Oui\",'Feuille perso'!$A$22:$N$26,13,FALSE))","v":0},0,"Pièges",null,null,null,0,"Odorat",null,null,null,0,"Marchandage",null,null,null,0,"Politique",null,null,null,0,null,null,null,null,null,null,null,null,null,0,0,0,0,0,0]
[12,{"$f":"IF(AND(C13>5,D14=\"\",B13<>0),AG17,0)","v":0},null,null,"Reste",{"$f":"IF(F12-F13<0,0,F12-F13)","v":0},"Métallurgie",null,null,null,0,"Précision",null,null,null,0,"Orientation",null,null,null,0,"Performance",null,null,null,0,"Rituel du Trépas",null,null,null,0,null,null,null,null,null,null,null,null,null,0,0,0,0,0,0]
[13,"Mercenaire",null,null,"Trop",{"$f":"IF(F13-F12<0,0,F13-F12)","v":0},"Natation",null,null,{"$f":"IF(AND('Feuille perso'!$B$22=0,'Feuille perso'!$B$23=0,'Feuille perso'!$B$24=0,'Feuille perso'!$B$25=0,'Feuille perso'!$B$26=0),0,VLOOKUP(\"Oui\",'Feuille perso'!$A$22:$N$26,12,FALSE)+VLOOKUP(\"Oui\",'Feuille perso'!$A$22:$N$26,13,FALSE))","v":0},0,"Technologie",null,null,null,0,"Perception",null,null,null,0,"Rumeurs",null,null,null,0,"Sortilèges",null,null,null,0,null,"Mercenaire",1,1,null,null,null,1,null,0,0,0,0,0,0,6,3,6]
[14,{"$f":"IF(AND(C15>5,D16=\"\"),AG19,0)","v":0},null,null,null,null,"Navigation",null,null,null,0,"Thanatologie",null,null,null,0,"Pistage",null,null,null,0,"Séduction",null,null,null,0,"Tactiques",null,null,null,0,null,null,null,null,null,null,null,null,null,0,0,0,0,0,0]
[15,{"$f":"IF(AND(C16>5,D17=\"\",B16<>0),AG20,0)","v":0},null,null,"# de pex dépensé",{"$f":"AT156","v":0},"Torture",null,null,null,0,"Vol à la tire",null,null,{"$f":"IF(AND('Feuille perso'!$B$22=0,'Feuille perso'!$B$23=0,'Feuille perso'!$B$24=0,'Feuille perso'!$B$25=0,'Feuille perso'!$B$26=0),0,VLOOKUP(\"Oui\",'Feuille perso'!$A$22:$N$26,12,FALSE)+VLOOKUP(\"Oui\",'Feuille perso'!$A$22:$N$26,13,FALSE))","v":0},0,"Recherche",null,null,null,0,"Ventriloquie",null,null,null,0,"Théologie",null,null,null,0,null,null,null,null,null,null,null,null,null,0,0,0,0,0,0]
[16,"Archer",null,null,"# de pex reçu",{"$f":"'Feuille perso'!C1","v":0},"Dragonnerie",null,null,null,0,"Tatouage Tribal",null,null,null,0,"P.E.S.",null,null,null,0,"Ignisalta",null,null,null,0,"Rituel des étoiles",null,null,null,0,null,"Archer",null,1,1,null,null,1,null,0,0,0,0,0,0,6,4,5]
[17,{"$f":"IF(AND(C18>5,D19=\"\"),AG22,0)","v":0},null,null,"Reste",{"$f":"IF(F18-F17<0,0,F18-F17)","v":0},null,null,null,null,0,null,null,null,null,0,null,null,null,null,0,null,null,null,null,0,null,null,null,null,0,null,null,null,null,null,null,null,null,null,0,0,0,0,0,0]
[18,{"$f":"IF(AND(C19>5,D20=\"\",B19<>0),AG23,0)","v":0},null,null,"Trop",{"$f":"IF(F17-F18<0,0,F17-F18)","v":0},null,null,null,null,null,null,null,null,null,null,null,null,null,null,null,null,null,null,null,null,null,null,null,null,null,null,null,null,null,null,null,null,null,null,0,0,0,0,0,0]
{"$rows_left_out":175}
{"sheet":"Équipement-Titre","index":3,"n_rows":195,"n_cols":30,"rows_kept":195,"cut":false,"hidden":true,"merged":[]}
["Titre","Or",null,"Arme","Portée","Attaque","Critique","Maladresse","Face","Flanc","Dos","Type",null,"Bouclier","Physique","Champ d'action","Face","Flanc","Dos",null,null,null,null,null,null,null,"Grimoire","Aucun","Sacré","Maudit"]
[]
["Adjudant",6,null,"Acier des anges",2,42,300,10,5,3,3,"M / P",null,"Aucun",0,0,0,0,0,null,null,null,null,null,null,null,"Arcannes noires",0.2,null,0.2]
["Amiral",50,null,"Âmes Trahies",1,25,300,9,2,2,2,"M / P",null,"Bouclier improvisé",4,-3,8,10,"-",null,null,null,null,null,null,null,"Arcannum",0.4]
["Archevêque",25,null,"Ange gardien",11,22,200,11,5,4,4,"T / P",null,"Bouclier Tour",7,-4,6,7,9,null,null,null,null,null,null,null,"Bible bénit",null,0.2]
["Cadet",2,null,"Arbalète à répétition",7,29,350,10,4,4,4,"T / P",null,"Défense de Richard",6,-3,5,6,9,null,null,null,null,null,null,null,"Bible Commune",null,0.1]
["Capitaine",25,null,"Arbalète de concours",7,16,250,10,5,5,5,"T / P",null,"Dragonien",5,-2,5,7,10,null,null,null,null,null,null,null,"Bible de l'archevêque Lorin",0.3,0.3]
["Caporal",6,null,"Arbalète de siège",8,22,300,10,5,5,5,"T / P",null,"Écu",4,-2,7,8,9,null,null,null,null,null,null,null,"Bible originale de Fedoranne",0.3,0.5]
["Cardinal",40,null,"Arbalète improvisée",5,11,200,10,7,7,6,"T / P",null,"Écu Sormand",6,-3,7,7,8,null,null,null,null,null,null,null,"Grimoire de nécromancie",null,null,0.3]
["Clerc",7,null,"Arbalète légère",6,13,250,10,7,6,6,"T / P",null,"Garde de Valiant",6,-3,4,6,8,null,null,null,null,null,null,null,"Grimoire des morts",null,null,0.4]
["Colonel",35,null,"Arbalète lourde",7,17,300,10,6,6,5,"T / P",null,"Grand bouclier",6,-4,7,8,10,null,null,null,null,null,null,null,"Grimoire Shinir",0.4,null,0.3]
["Commandant",25,null,"Arbalète militaire",6,13,250,10,7,6,6,"T / P",null,"Pavois noble",6,-3,5,8,"-",null,null,null,null,null,null,null,"Libertam Morbid",0.2,null,0.3]
["Commodore",35,null,"Arc ancien",10,19,200,11,6,5,5,"T / P",null,"Petit bouclier",3,-1,8,10,10,null,null,null,null,null,null,null,"Libras Majoris",0.3]
["Diacre",3,null,"Arc court",7,9,150,11,8,6,6,"T / P",null,"Rempart du mage",3,-1,7,9,9,null,null,null,null,null,null,null,"Lucend Virtuos",0.2,0.4]
["Évêque",15,null,"Arc des cieux",11,26,250,11,4,4,3,"T / P",null,"Rondache",5,-2,8,9,9,null,null,null,null,null,null,null,"Main de Valiant",null,0.4]
["Général",50,null,"Arc franc",8,16,200,11,6,5,4,"T / P",null,"Saint-Norec",7,-4,4,6,9,null,null,null,null,null,null,null,"Manifeste du Dualisme",null,0.2,0.2]
["Junior",1,null,"Arc long",9,12,150,11,7,5,5,"T / P",null,"Targe",5,-2,6,9,"-",null,null,null,null,null,null,null,"Manuel de l'apprenti",0.1]
["Lieutenant",12,null,"Arc Primitif",4,6,150,12,9,8,7,"T / P",null,"Valarius",4,-1,5,7,7,null,null,null,null,null,null,null,"Omega Opus",0.5,0.2,0.2]
["Lieutenant Major",14,null,"Arme du juste",1,15,150,10,5,5,5,"M / T",null,null,null,null,null,null,null,null,null,null,null,null,null,null,"Petit livre noir",null,null,0.2]
["Major",17,null,"Arquebuse",5,23,200,12,7,5,5,"T / F",null,"Armures","Perçant","Tranchant","Contondant","Feu","Sortilège","Encombrement mouvement","Encombrement compétence","Magie",null,null,null,null,"Propagande cultiste",null,null,0.1]
{"$rows_left_out":175}